NutConfigure make Output of Nut/OS  4.7.4 WinARM GCC 3.4.3


E:\ethernut_4.7.4>echo p1 = compiler version with dots x.y.z p2 = compiler version w/o dots xyz p3 = ethernut verison w/o dots p4 = ethernut with dots
p1 = compiler version with dots x.y.z p2 = compiler version w/o dots xyz p3 = ethernut verison w/o dots p4 = ethernut with dots

E:\ethernut_4.7.4>path=e:\ethernut_4.7.4\nut\tools\win32;d:drv-d\winarm_3.4.3\gnuarm\bin;d:\drv-d\winarm_3.4.3\winarm\bin;e:\windows;e:\windows\system32;e:\windows\system32;wbem;

E:\ethernut_4.7.4>nutconfigure -a./nutapp_arm_3.4.3 -c./nut/conf/ethernut30d.conf -marm-gcc -b./nutbld_arm_3.4.3 create-buildtree
nutconfigure 2.0.6
Loading ./nut/conf/repository.nut...OK
Loading ./nut/conf/ethernut30d.conf...OK
Creating Makefiles for arm-gcc in ./nutbld_arm_3.4.3...OK
Creating header files in ./nutbld_arm_3.4.3...OK

E:\ethernut_4.7.4>cd nutbld_arm_3.4.3

E:\ethernut_4.7.4\nutbld_arm_3.4.3>make clean 1>makeclean.txt

E:\ethernut_4.7.4\nutbld_arm_3.4.3>make install 1>..\c474c343arm.txt
In file included from ../.././nut/arch/arm/os/context.c:96:
../.././nut/include/sys/atom.h:103:20: stdint.h: No such file or directory
In file included from ../.././nut/arch/arm/os/context.c:98:
../.././nut/include/sys/thread.h:164: error: parse error before "uint8_t"
../.././nut/include/sys/thread.h:164: warning: no semicolon at end of struct or union
../.././nut/include/sys/thread.h:166: error: parse error before "td_priority"
../.././nut/include/sys/thread.h:166: warning: type defaults to `int' in declaration of `td_priority'
../.././nut/include/sys/thread.h:166: warning: data definition has no type or storage class
../.././nut/include/sys/thread.h:167: error: parse error before '*' token
../.././nut/include/sys/thread.h:167: warning: type defaults to `int' in declaration of `td_memory'
../.././nut/include/sys/thread.h:167: warning: data definition has no type or storage class
../.././nut/include/sys/thread.h:177: error: parse error before '}' token
../.././nut/include/sys/thread.h:207: error: parse error before "NutThreadSetPriority"
../.././nut/include/sys/thread.h:207: error: parse error before "level"
../.././nut/include/sys/thread.h:207: warning: type defaults to `int' in declaration of `NutThreadSetPriority'
../.././nut/include/sys/thread.h:207: warning: function declaration isn't a prototype
../.././nut/include/sys/thread.h:207: warning: data definition has no type or storage class
../.././nut/arch/arm/os/context.c:114: error: parse error before "uint32_t"
../.././nut/arch/arm/os/context.c:114: warning: no semicolon at end of struct or union
../.././nut/arch/arm/os/context.c:115: warning: type defaults to `int' in declaration of `csf_r4'
../.././nut/arch/arm/os/context.c:115: warning: data definition has no type or storage class
../.././nut/arch/arm/os/context.c:116: error: parse error before "csf_r5"
../.././nut/arch/arm/os/context.c:116: warning: type defaults to `int' in declaration of `csf_r5'
../.././nut/arch/arm/os/context.c:116: warning: data definition has no type or storage class
../.././nut/arch/arm/os/context.c:117: error: parse error before "csf_r6"
../.././nut/arch/arm/os/context.c:117: warning: type defaults to `int' in declaration of `csf_r6'
../.././nut/arch/arm/os/context.c:117: warning: data definition has no type or storage class
../.././nut/arch/arm/os/context.c:118: error: parse error before "csf_r7"
../.././nut/arch/arm/os/context.c:118: warning: type defaults to `int' in declaration of `csf_r7'
../.././nut/arch/arm/os/context.c:118: warning: data definition has no type or storage class
../.././nut/arch/arm/os/context.c:119: error: parse error before "csf_r8"
../.././nut/arch/arm/os/context.c:119: warning: type defaults to `int' in declaration of `csf_r8'
../.././nut/arch/arm/os/context.c:119: warning: data definition has no type or storage class
../.././nut/arch/arm/os/context.c:120: error: parse error before "csf_r9"
../.././nut/arch/arm/os/context.c:120: warning: type defaults to `int' in declaration of `csf_r9'
../.././nut/arch/arm/os/context.c:120: warning: data definition has no type or storage class
../.././nut/arch/arm/os/context.c:121: error: parse error before "csf_r10"
../.././nut/arch/arm/os/context.c:121: warning: type defaults to `int' in declaration of `csf_r10'
../.././nut/arch/arm/os/context.c:121: warning: data definition has no type or storage class
../.././nut/arch/arm/os/context.c:122: error: parse error before "csf_r11"
../.././nut/arch/arm/os/context.c:122: warning: type defaults to `int' in declaration of `csf_r11'
../.././nut/arch/arm/os/context.c:122: warning: data definition has no type or storage class
../.././nut/arch/arm/os/context.c:123: error: parse error before "csf_lr"
../.././nut/arch/arm/os/context.c:123: warning: type defaults to `int' in declaration of `csf_lr'
../.././nut/arch/arm/os/context.c:123: warning: data definition has no type or storage class
../.././nut/arch/arm/os/context.c:124: warning: type defaults to `int' in declaration of `SWITCHFRAME'
../.././nut/arch/arm/os/context.c:124: warning: data definition has no type or storage class
../.././nut/arch/arm/os/context.c:132: error: parse error before "uint32_t"
../.././nut/arch/arm/os/context.c:132: warning: no semicolon at end of struct or union
../.././nut/arch/arm/os/context.c:133: warning: type defaults to `int' in declaration of `cef_pc'
../.././nut/arch/arm/os/context.c:133: warning: data definition has no type or storage class
../.././nut/arch/arm/os/context.c:134: warning: type defaults to `int' in declaration of `ENTERFRAME'
../.././nut/arch/arm/os/context.c:134: warning: data definition has no type or storage class
../.././nut/arch/arm/os/context.c: In function `NutThreadSwitch':
../.././nut/arch/arm/os/context.c:168: error: dereferencing pointer to incomplete type
../.././nut/arch/arm/os/context.c:173: error: dereferencing pointer to incomplete type
../.././nut/arch/arm/os/context.c:184: error: dereferencing pointer to incomplete type
../.././nut/arch/arm/os/context.c: In function `NutThreadCreate':
../.././nut/arch/arm/os/context.c:213: error: `uint8_t' undeclared (first use in this function)
../.././nut/arch/arm/os/context.c:213: error: (Each undeclared identifier is reported only once
../.././nut/arch/arm/os/context.c:213: error: for each function it appears in.)
../.././nut/arch/arm/os/context.c:213: error: `threadMem' undeclared (first use in this function)
../.././nut/arch/arm/os/context.c:214: error: `sf' undeclared (first use in this function)
../.././nut/arch/arm/os/context.c:215: error: `ef' undeclared (first use in this function)
../.././nut/arch/arm/os/context.c:246: error: invalid application of `sizeof' to incomplete type `../.././nut/include/sys/thread.h'
../.././nut/arch/arm/os/context.c:250: error: parse error before ')' token
../.././nut/arch/arm/os/context.c:251: error: parse error before ')' token
../.././nut/arch/arm/os/context.c:257: error: `uint32_t' undeclared (first use in this function)
../.././nut/arch/arm/os/context.c:257: error: parse error before ')' token
../.././nut/arch/arm/os/context.c:258: error: parse error before ')' token
../.././nut/arch/arm/os/context.c:259: error: parse error before ')' token
../.././nut/arch/arm/os/context.c:260: error: parse error before ')' token
../.././nut/arch/arm/os/context.c:278: error: dereferencing pointer to incomplete type
../.././nut/arch/arm/os/context.c:278: error: dereferencing pointer to incomplete type
../.././nut/arch/arm/os/context.c:279: error: dereferencing pointer to incomplete type
../.././nut/arch/arm/os/context.c:279: error: dereferencing pointer to incomplete type
../.././nut/arch/arm/os/context.c:280: error: dereferencing pointer to incomplete type
../.././nut/arch/arm/os/context.c:281: error: dereferencing pointer to incomplete type
../.././nut/arch/arm/os/context.c:282: error: dereferencing pointer to incomplete type
../.././nut/arch/arm/os/context.c:283: error: dereferencing pointer to incomplete type
../.././nut/arch/arm/os/context.c:284: error: dereferencing pointer to incomplete type
../.././nut/arch/arm/os/context.c:285: error: dereferencing pointer to incomplete type
../.././nut/arch/arm/os/context.c:288: error: dereferencing pointer to incomplete type
../.././nut/arch/arm/os/context.c:299: error: dereferencing pointer to incomplete type
../.././nut/arch/arm/os/context.c:309: error: dereferencing pointer to incomplete type
../.././nut/arch/arm/os/context.c:318: error: dereferencing pointer to incomplete type
make[1]: *** [arm/os/context.o] Error 1
make: *** [install] Error 2

E:\ethernut_4.7.4\nutbld_arm_3.4.3>cd ..

E:\ethernut_4.7.4>nutconfigure -a./nutapp_arm_3.4.3 -c./nut/conf/ethernut30d.conf -marm-gcc -b./nutbld_arm_3.4.3 create-apptree
nutconfigure 2.0.6
Loading ./nut/conf/repository.nut...OK
Loading ./nut/conf/ethernut30d.conf...OK
OK
Copying ./nut/app
Copying ./nut/app/basemon
Copying ./nut/app/basemon/html
Copying ./nut/app/caltime
Copying ./nut/app/canbus
Copying ./nut/app/cppdemo
Copying ./nut/app/events
Copying ./nut/app/ftpd
Copying ./nut/app/httpd
Copying ./nut/app/httpd/sample
Copying ./nut/app/httpd/sample/flash
Copying ./nut/app/inetq
Copying ./nut/app/isp2
Copying ./nut/app/isp2/isp
Copying ./nut/app/logtime
Copying ./nut/app/nutpiper
Copying ./nut/app/playmp3
Copying ./nut/app/playmp3/sounds
Copying ./nut/app/portdio
Copying ./nut/app/pppc
Copying ./nut/app/rs232d
Copying ./nut/app/simple
Copying ./nut/app/snmpd
Copying ./nut/app/tcps
Copying ./nut/app/threads
Copying ./nut/app/timers
Copying ./nut/app/uart

NutConfigure Make gcc details

make -C arch install
make[1]: Entering directory `E:/ethernut_4.7.4/nutbld_arm_3.4.3/arch'
arm-elf-gcc -c -mcpu=arm7tdmi -Os -mthumb-interwork -fomit-frame-pointer -Wall -Werror -Wstrict-prototypes -Wa,-ahlms=arm/os/context.lst -DETHERNUT3 -I../.././nutbld_arm_3.4.3/include -I../.././nut/include ../.././nut/arch/arm/os/context.c -o arm/os/context.o
make[1]: Leaving directory `E:/ethernut_4.7.4/nutbld_arm_3.4.3/arch'